BDBM50467370 CHEMBL4278759
SMILES CCN(CC)c1ncc2c(Nc3n[nH]c(C)c3N=C2c2ccc(C)cc2)n1
InChI Key InChIKey=LVJOSXIHDWKFCU-UHFFFAOYSA-N
Data  3 IC50
  Tab Delimited (TSV)   2D SDfile   Computed 3D by Vconf -m prep SDfile
Find this compound or compounds like it in BindingDB:
Activity Spreadsheet -- Enzyme Inhibition Constant Data from BindingDB
Found 1 hit for monomerid = 50467370
TargetVascular endothelial growth factor receptor 2(Homo sapiens (Human))
East China Normal University
Curated by ChEMBL
LigandPNGBDBM50467370(CHEMBL4278759)
Affinity DataIC50:  8.30nM. Assay description: Inhibition of recombinant human N-terminal His6-tagged KDR (790 to end residues) expressed in baculovirus infected Sf21 insect cells after 60 mins by...
Ligand InfoPC cidPC sid
In DepthDetails ArticlePubMed